Target
Solute carrier family 22 member 6
Ligand
BDBM50482777
Substrate
Meas. Tech.
ChEMBL_838502 (CHEMBL2078130)
IC50
>2000000±n/a nM
Citation
 Jung, KYTakeda, MShimoda, MNarikawa, STojo, AKim, DKChairoungdua, AChoi, BKKusuhara, HSugiyama, YSekine, TEndou, H Involvement of rat organic anion transporter 3 (rOAT3) in cephaloridine-induced nephrotoxicity: in comparison with rOAT1. Life Sci 70:1861-74 (2002)  
Target
Name:
Solute carrier family 22 member 6
Synonyms:
Oat1 S22A6_RAT rOAT1 renal organic anion transporter 1
Type:
PROTEIN
Mol. Mass.:
60784.17
Organism:
Rattus norvegicus
Description:
ChEMBL_838479
Residue:
551
  
Inhibitor
Name:
BDBM50482777
Synonyms:
CHEBI:204928 | Cefotaxime
Type:
Small organic molecule
Emp. Form.:
C16H17N5O7S2
Mol. Mass.:
455.465
SMILES:
[H][C@]12SCC(COC(C)=O)=C(N1C(=O)[C@H]2NC(=O)C(=N/OC)\c1csc(N)n1)C(O)=O
: