Target
Casein kinase I isoform delta
Ligand
BDBM50537592
Substrate
Meas. Tech.
ChEMBL_1969968 (CHEMBL4602786)
Ki
40±n/a nM
Citation
 Roy, SMMinasov, GArancio, OChico, LWVan Eldik, LJAnderson, WFPelletier, JCWatterson, DM A Selective and Brain Penetrant p38?MAPK Inhibitor Candidate for Neurologic and Neuropsychiatric Disorders That Attenuates Neuroinflammation and Cognitive Dysfunction. J Med Chem 62:5298-5311 (2019)  
Target
Name:
Casein kinase I isoform delta
Synonyms:
CKI-delta CSNK1D Casein kinase I delta Casein kinase I isoform delta (CK1D) KC1D_HUMAN | casein kinases 1 delta (CK1 delta)
Type:
Enzyme
Mol. Mass.:
47356.76
Organism:
Homo sapiens (Human)
Description:
P48730
Residue:
415
  
Inhibitor
Name:
BDBM50537592
Synonyms:
CHEMBL4632881
Type:
Small organic molecule
Emp. Form.:
C23H21N7
Mol. Mass.:
395.4597
SMILES:
C1CN(CCN1c1cc(-c2ccncc2)c(nn1)-c1ccccc1)c1ncccn1
: