Target
Endothelin-1 receptor
Ligand
BDBM50032174
Substrate
Meas. Tech.
ChEMBL_63185 (CHEMBL677396)
IC50
230±n/a nM
Citation
 Cody, WLHe, JXDePue, PLWaite, LALeonard, DMSefler, AMKaltenbronn, JSHaleen, SJWalker, DMFlynn, MA Structure-activity relationships of the potent combined endothelin-A/endothelin-B receptor antagonist Ac-DDip16-Leu-Asp-Ile-Ile-Trp21: development of endothelin-B receptor selective antagonists. J Med Chem 38:2809-19 (1995)  
Target
Name:
Endothelin-1 receptor
Synonyms:
EDNRA ET-A ETA-R Endothelin receptor type A hET-AR
Type:
Enzyme Catalytic Domain
Mol. Mass.:
48736.88
Organism:
Homo sapiens (Human)
Description:
P25101
Residue:
427
  
Inhibitor
Name:
BDBM50032174
Synonyms:
(S)-3-[(S)-2-((S)-2-Acetylamino-3,3-diphenyl-propionylamino)-4-methyl-pentanoylamino]-N-((1S,2S)-1-{(S)-1-[(S)-1-carboxy-2-(1H-indol-3-yl)-ethylcarbamoyl]-3-methyl-butylcarbamoyl}-2-methyl-butyl)-succinamic acid | CHEMBL97431
Type:
Small organic molecule
Emp. Form.:
C50H65N7O10
Mol. Mass.:
924.092
SMILES:
CC[C@H](C)[C@H](NC(=O)[C@H](CC(O)=O)NC(=O)[C@H](CC(C)C)NC(=O)[C@@H](NC(C)=O)C(c1ccccc1)c1ccccc1)C(=O)N[C@@H](CC(C)C)C(=O)N[C@@H](Cc1c[nH]c2ccccc12)C(O)=O
: