Target
Endothelin receptor type B
Ligand
BDBM50032181
Substrate
Meas. Tech.
ChEMBL_64034 (CHEMBL671553)
IC50
15±n/a nM
Citation
 Cody, WLHe, JXDePue, PLWaite, LALeonard, DMSefler, AMKaltenbronn, JSHaleen, SJWalker, DMFlynn, MA Structure-activity relationships of the potent combined endothelin-A/endothelin-B receptor antagonist Ac-DDip16-Leu-Asp-Ile-Ile-Trp21: development of endothelin-B receptor selective antagonists. J Med Chem 38:2809-19 (1995)  
Target
Name:
Endothelin receptor type B
Synonyms:
EDNRB_RAT ET-B Endothelin receptor | Endothelin receptor non-selective type
Type:
Enzyme Catalytic Domain
Mol. Mass.:
49483.43
Organism:
RAT
Description:
ENDOTHELIN B EDNRB RAT::P21451
Residue:
442
  
Inhibitor
Name:
BDBM50032181
Synonyms:
2-{1-[1-(2-carboxy-1-{1-[10,11-dihydro-5H-dibenzo[a,d]cyclohepten-5-yl(methylcarboxamido)methylcarboxamido]-3-methylbutylcarboxamido}ethylcarboxamido)-2-methylbutylcarboxamido]-2-methylbutylcarboxamido}-3-(1H-3-indolyl)propanoic acid CHEMBL262993
Type:
Small organic molecule
Emp. Form.:
C52H67N7O10
Mol. Mass.:
950.1293
SMILES:
CC[C@H](C)[C@H](NC(=O)[C@@H](NC(=O)[C@H](CC(O)=O)NC(=O)[C@H](CC(C)C)NC(=O)[C@@H](NC(C)=O)C1c2ccccc2CCc2ccccc12)[C@@H](C)CC)C(=O)N[C@@H](Cc1c[nH]c2ccccc12)C(O)=O
: