Target
Endothelin-1 receptor
Ligand
BDBM50032198
Substrate
Meas. Tech.
ChEMBL_63185 (CHEMBL677396)
IC50
36±n/a nM
Citation
 Cody, WLHe, JXDePue, PLWaite, LALeonard, DMSefler, AMKaltenbronn, JSHaleen, SJWalker, DMFlynn, MA Structure-activity relationships of the potent combined endothelin-A/endothelin-B receptor antagonist Ac-DDip16-Leu-Asp-Ile-Ile-Trp21: development of endothelin-B receptor selective antagonists. J Med Chem 38:2809-19 (1995)  
Target
Name:
Endothelin-1 receptor
Synonyms:
EDNRA ET-A ETA-R Endothelin receptor type A hET-AR
Type:
Enzyme Catalytic Domain
Mol. Mass.:
48736.88
Organism:
Homo sapiens (Human)
Description:
P25101
Residue:
427
  
Inhibitor
Name:
BDBM50032198
Synonyms:
(S)-2-[(2S,3S)-2-((2S,3S)-2-{(S)-2-[(S)-2-((S)-2-Acetylamino-3-phenyl-propionylamino)-4-methyl-pentanoylamino]-3-phenyl-propionylamino}-3-methyl-pentanoylamino)-3-methyl-pentanoylamino]-3-(1H-indol-3-yl)-propionic acid | CHEMBL421190
Type:
Small organic molecule
Emp. Form.:
C49H65N7O8
Mol. Mass.:
880.0825
SMILES:
CC[C@H](C)[C@H](NC(=O)[C@@H](NC(=O)[C@H](Cc1ccccc1)NC(=O)[C@H](CC(C)C)NC(=O)[C@H](Cc1ccccc1)NC(C)=O)[C@@H](C)CC)C(=O)N[C@@H](Cc1c[nH]c2ccccc12)C(O)=O
: