Target
Endothelin receptor type B
Ligand
BDBM50032214
Substrate
Meas. Tech.
ChEMBL_64034 (CHEMBL671553)
IC50
190±n/a nM
Citation
 Cody, WLHe, JXDePue, PLWaite, LALeonard, DMSefler, AMKaltenbronn, JSHaleen, SJWalker, DMFlynn, MA Structure-activity relationships of the potent combined endothelin-A/endothelin-B receptor antagonist Ac-DDip16-Leu-Asp-Ile-Ile-Trp21: development of endothelin-B receptor selective antagonists. J Med Chem 38:2809-19 (1995)  
Target
Name:
Endothelin receptor type B
Synonyms:
EDNRB_RAT ET-B Endothelin receptor | Endothelin receptor non-selective type
Type:
Enzyme Catalytic Domain
Mol. Mass.:
49483.43
Organism:
RAT
Description:
ENDOTHELIN B EDNRB RAT::P21451
Residue:
442
  
Inhibitor
Name:
BDBM50032214
Synonyms:
(S)-N-((1S,2S)-1-{(1S,2S)-1-[(S)-1-Carboxy-2-(1H-indol-3-yl)-ethylcarbamoyl]-2-methyl-butylcarbamoyl}-2-methyl-butyl)-3-((S)-2-{(S)-3,3-diphenyl-2-[(pyridine-3-carbonyl)-amino]-propionylamino}-4-methyl-pentanoylamino)-succinamic acid | CHEMBL265734
Type:
Small organic molecule
Emp. Form.:
C54H66N8O10
Mol. Mass.:
987.1494
SMILES:
CC[C@H](C)[C@H](NC(=O)[C@@H](NC(=O)[C@H](CC(O)=O)NC(=O)[C@H](CC(C)C)NC(=O)[C@@H](NC(=O)c1cccnc1)C(c1ccccc1)c1ccccc1)[C@@H](C)CC)C(=O)N[C@@H](Cc1c[nH]c2ccccc12)C(O)=O
: