Target
Endothelin receptor type B
Ligand
BDBM50032201
Substrate
Meas. Tech.
ChEMBL_64034 (CHEMBL671553)
IC50
80±n/a nM
Citation
 Cody, WLHe, JXDePue, PLWaite, LALeonard, DMSefler, AMKaltenbronn, JSHaleen, SJWalker, DMFlynn, MA Structure-activity relationships of the potent combined endothelin-A/endothelin-B receptor antagonist Ac-DDip16-Leu-Asp-Ile-Ile-Trp21: development of endothelin-B receptor selective antagonists. J Med Chem 38:2809-19 (1995)  
Target
Name:
Endothelin receptor type B
Synonyms:
EDNRB_RAT ET-B Endothelin receptor | Endothelin receptor non-selective type
Type:
Enzyme Catalytic Domain
Mol. Mass.:
49483.43
Organism:
RAT
Description:
ENDOTHELIN B EDNRB RAT::P21451
Residue:
442
  
Inhibitor
Name:
BDBM50032201
Synonyms:
(S)-2-((2S,3S)-2-{(2S,3S)-2-[(S)-2-[(S)-2-((S)-2-Acetylamino-3,3-diphenyl-propionylamino)-4-methyl-pentanoylamino]-3-(4-hydroxy-phenyl)-propionylamino]-3-methyl-pentanoylamino}-3-methyl-pentanoylamino)-3-(1H-indol-3-yl)-propionic acid | CHEMBL384728
Type:
Small organic molecule
Emp. Form.:
C55H69N7O9
Mol. Mass.:
972.1779
SMILES:
CC[C@H](C)[C@H](NC(=O)[C@H](Cc1ccc(O)cc1)NC(=O)[C@H](CC(C)C)NC(=O)[C@@H](NC(C)=O)C(c1ccccc1)c1ccccc1)C(=O)N[C@@H]([C@@H](C)CC)C(=O)N[C@@H](Cc1c[nH]c2ccccc12)C(O)=O
: