Target
Sigma non-opioid intracellular receptor 1
Ligand
BDBM50032428
Substrate
Meas. Tech.
ChEMBL_202059 (CHEMBL813142)
Ki
365±n/a nM
Citation
 Danso-Danquah, RBai, XZhang, XMascarella, SWWilliams, WSine, BBowen, WDCarroll, FI Synthesis and sigma binding properties of 1'- and 3'-halo- and 1',3'-dihalo-N-normetazocine analogues. J Med Chem 38:2986-9 (1995)  
Target
Name:
Sigma non-opioid intracellular receptor 1
Synonyms:
Opioid receptor SGMR1_RAT Sigma non-opioid intracellular receptor 1 Sigma-1 | Sigmar1
Type:
Enzyme Catalytic Domain
Mol. Mass.:
25266.54
Organism:
RAT
Description:
Q9R0C9
Residue:
223
  
Inhibitor
Name:
BDBM50032428
Synonyms:
9-Bromo-6,11-dimethyl-3-(3-methyl-but-2-enyl)-1,2,3,4,5,6-hexahydro-2,6-methano-benzo[d]azocin-8-ol | CHEMBL102860
Type:
Small organic molecule
Emp. Form.:
C19H26BrNO
Mol. Mass.:
364.32
SMILES:
[#6]-[#6]1-[#6]-2-[#6]-c3cc(Br)c(-[#8])cc3C1([#6])[#6]-[#6]-[#7]-2-[#6]\[#6]=[#6](/[#6])-[#6]
: