Target
Sigma non-opioid intracellular receptor 1
Ligand
BDBM50032420
Substrate
Meas. Tech.
ChEMBL_202059 (CHEMBL813142)
Ki
2010±n/a nM
Citation
 Danso-Danquah, RBai, XZhang, XMascarella, SWWilliams, WSine, BBowen, WDCarroll, FI Synthesis and sigma binding properties of 1'- and 3'-halo- and 1',3'-dihalo-N-normetazocine analogues. J Med Chem 38:2986-9 (1995)  
Target
Name:
Sigma non-opioid intracellular receptor 1
Synonyms:
Opioid receptor SGMR1_RAT Sigma non-opioid intracellular receptor 1 Sigma-1 | Sigmar1
Type:
Enzyme Catalytic Domain
Mol. Mass.:
25266.54
Organism:
RAT
Description:
Q9R0C9
Residue:
223
  
Inhibitor
Name:
BDBM50032420
Synonyms:
3-Benzyl-7,9-dibromo-6,11-dimethyl-1,2,3,4,5,6-hexahydro-2,6-methano-benzo[d]azocin-8-ol | CHEMBL328608
Type:
Small organic molecule
Emp. Form.:
C21H23Br2NO
Mol. Mass.:
465.221
SMILES:
CC1C2Cc3cc(Br)c(O)c(Br)c3C1(C)CCN2Cc1ccccc1
: