Target
Sigma non-opioid intracellular receptor 1
Ligand
BDBM50032423
Substrate
Meas. Tech.
ChEMBL_201918 (CHEMBL872703)
Ki
2.62±n/a nM
Citation
 Danso-Danquah, RBai, XZhang, XMascarella, SWWilliams, WSine, BBowen, WDCarroll, FI Synthesis and sigma binding properties of 1'- and 3'-halo- and 1',3'-dihalo-N-normetazocine analogues. J Med Chem 38:2986-9 (1995)  
Target
Name:
Sigma non-opioid intracellular receptor 1
Synonyms:
Aging-associated gene 8 protein SGMR1_HUMAN SIGMAR1 SR31747-binding protein Sigma 1-type opioid receptor Sigma1R | hSigmaR1
Type:
Enzyme Catalytic Domain
Mol. Mass.:
25124.85
Organism:
Homo sapiens (Human)
Description:
Q99720
Residue:
223
  
Inhibitor
Name:
BDBM50032423
Synonyms:
7-Chloro-6,11-dimethyl-3-(3-methyl-but-2-enyl)-1,2,3,4,5,6-hexahydro-2,6-methano-benzo[d]azocin-8-ol | CHEMBL318954
Type:
Small organic molecule
Emp. Form.:
C19H26ClNO
Mol. Mass.:
319.869
SMILES:
[#6]-[#6]1-[#6]-2-[#6]-c3ccc(-[#8])c(Cl)c3C1([#6])[#6]-[#6]-[#7]-2-[#6]\[#6]=[#6](/[#6])-[#6]
: