Target
Sigma non-opioid intracellular receptor 1
Ligand
BDBM50032426
Substrate
Meas. Tech.
ChEMBL_201918 (CHEMBL872703)
Ki
1.75±n/a nM
Citation
 Danso-Danquah, RBai, XZhang, XMascarella, SWWilliams, WSine, BBowen, WDCarroll, FI Synthesis and sigma binding properties of 1'- and 3'-halo- and 1',3'-dihalo-N-normetazocine analogues. J Med Chem 38:2986-9 (1995)  
Target
Name:
Sigma non-opioid intracellular receptor 1
Synonyms:
Aging-associated gene 8 protein SGMR1_HUMAN SIGMAR1 SR31747-binding protein Sigma 1-type opioid receptor Sigma1R | hSigmaR1
Type:
Enzyme Catalytic Domain
Mol. Mass.:
25124.85
Organism:
Homo sapiens (Human)
Description:
Q99720
Residue:
223
  
Inhibitor
Name:
BDBM50032426
Synonyms:
3-Benzyl-7-bromo-6,11-dimethyl-1,2,3,4,5,6-hexahydro-2,6-methano-benzo[d]azocin-8-ol | CHEMBL103455
Type:
Small organic molecule
Emp. Form.:
C21H24BrNO
Mol. Mass.:
386.325
SMILES:
CC1C2Cc3ccc(O)c(Br)c3C1(C)CCN2Cc1ccccc1
: