Target
Sigma non-opioid intracellular receptor 1
Ligand
BDBM50035131
Substrate
Meas. Tech.
ChEMBL_202059 (CHEMBL813142)
Ki
1540±n/a nM
Citation
 Danso-Danquah, RBai, XZhang, XMascarella, SWWilliams, WSine, BBowen, WDCarroll, FI Synthesis and sigma binding properties of 1'- and 3'-halo- and 1',3'-dihalo-N-normetazocine analogues. J Med Chem 38:2986-9 (1995)  
Target
Name:
Sigma non-opioid intracellular receptor 1
Synonyms:
Opioid receptor SGMR1_RAT Sigma non-opioid intracellular receptor 1 Sigma-1 | Sigmar1
Type:
Enzyme Catalytic Domain
Mol. Mass.:
25266.54
Organism:
RAT
Description:
Q9R0C9
Residue:
223
  
Inhibitor
Name:
BDBM50035131
Synonyms:
(+)-(6R,11S)-6,11-dimethyl-3-(3-methyl-but-2-enyl)-1,2,3,4,5,6-hexahydro-2,6-methano-benzo[d]azocin-8-ol (1S,9S,13S)-1,13-dimethyl-10-(3-methylbut-2-enyl)-10-azatricyclo[7.3.1.0~2,7~]trideca-2,4,6-trien-4-ol (2R,6R,11S)-6,11-dimethyl-3-(3-methyl-but-2-enyl)-1,2,3,4,5,6-hexahydro-2,6-methano-benzo[d]azocin-8-ol (2S,6S,11S)-6,11-Dimethyl-3-(3-methyl-but-2-enyl)-1,2,3,4,5,6-hexahydro-2,6-methano-benzo[d]azocin-8-ol 6,11-Dimethyl-3-(3-methyl-but-2-enyl)-1,2,3,4,5,6-hexahydro-2,6-ethano-benzo[d]azocin-8-ol(+)-pentazocine 6,11-Dimethyl-3-(3-methyl-but-2-enyl)-1,2,3,4,5,6-hexahydro-2,6-methano-benzo[d]azocin-8-ol ((+)-pentazocine) 6,11-Dimethyl-3-(3-methyl-but-2-enyl)-1,2,3,4,5,6-hexahydro-2,6-methano-benzo[d]azocin-8-ol((+)pentazocine) | CHEMBL60542
Type:
Small organic molecule
Emp. Form.:
C19H27NO
Mol. Mass.:
285.4238
SMILES:
[#6]-[#6@@H]1-[#6@@H]-2-[#6]-c3ccc(-[#8])cc3[C@@]1([#6])[#6]-[#6]-[#7]-2-[#6]\[#6]=[#6](/[#6])-[#6]
: