Target
Sigma non-opioid intracellular receptor 1
Ligand
BDBM50407300
Substrate
Meas. Tech.
ChEMBL_201917 (CHEMBL808206)
Ki
83.1±n/a nM
Citation
 Danso-Danquah, RBai, XZhang, XMascarella, SWWilliams, WSine, BBowen, WDCarroll, FI Synthesis and sigma binding properties of 1'- and 3'-halo- and 1',3'-dihalo-N-normetazocine analogues. J Med Chem 38:2986-9 (1995)  
Target
Name:
Sigma non-opioid intracellular receptor 1
Synonyms:
Aging-associated gene 8 protein SGMR1_HUMAN SIGMAR1 SR31747-binding protein Sigma 1-type opioid receptor Sigma1R | hSigmaR1
Type:
Enzyme Catalytic Domain
Mol. Mass.:
25124.85
Organism:
Homo sapiens (Human)
Description:
Q99720
Residue:
223
  
Inhibitor
Name:
BDBM50407300
Synonyms:
CHEMBL397705
Type:
Small organic molecule
Emp. Form.:
C19H27NO
Mol. Mass.:
285.4238
SMILES:
[#6]-[#6@@H]1-[#6@H]-2-[#6]-c3ccc(-[#8])cc3[C@]1([#6])[#6]-[#6]-[#7]-2-[#6]\[#6]=[#6](/[#6])-[#6]
: