Target
Purine nucleoside phosphorylase
Ligand
BDBM50033666
Substrate
Meas. Tech.
ChEMBL_162188 (CHEMBL766708)
Ki
11±n/a nM
Citation
 Kelley, JLMcLean, EWCrouch, RCAverett, DRTuttle, JV [[(Guaninylalkyl)phosphinico]methyl]phosphonic acids. Multisubstrate analogue inhibitors of human erythrocyte purine nucleoside phosphorylase. J Med Chem 38:1005-14 (1995)  
Target
Name:
Purine nucleoside phosphorylase
Synonyms:
Inosine phosphorylase NP PNPH_HUMAN | Purine nucleoside phosphorylase (PNPase)
Type:
Enzyme
Mol. Mass.:
32119.53
Organism:
Homo sapiens (Human)
Description:
Residue:
289
  
Inhibitor
Name:
BDBM50033666
Synonyms:
2-[(2-amino-6-oxo-1,6-dihydro-9H-purin-9-yl)methoxy]ethyl trihydrogen diphosphate(ACVDP) CHEMBL7193 | {[2-(2-Amino-6-oxo-1,6-dihydro-purin-9-ylmethoxy)-ethoxy]-hydroxy-diphosphate
Type:
Small organic molecule
Emp. Form.:
C8H13N5O9P2
Mol. Mass.:
385.1644
SMILES:
Nc1nc2n(COCCOP(O)(=O)OP(O)(O)=O)cnc2c(=O)[nH]1
: