Target
Cytochrome P450 11B2, mitochondrial
Ligand
BDBM8611
Substrate
Meas. Tech.
ChEMBL_177001 (CHEMBL779291)
IC50
600±n/a nM
Citation
 Hartmann, RWBayer, HGrün, GSergejew, TBartz, UMitrenga, M Pyridyl-substituted tetrahydrocyclopropa[a]naphthalenes: highly active and selective inhibitors of P450 arom. J Med Chem 38:2103-11 (1995)  
Target
Name:
Cytochrome P450 11B2, mitochondrial
Synonyms:
Aldosterone synthase CYPXIB2 Cyp11b2 Cytochrome P450 11B2 P450-Aldo-1 | Steroid 11-beta-hydroxylase
Type:
PROTEIN
Mol. Mass.:
58260.64
Organism:
Rattus norvegicus
Description:
ChEMBL_224979
Residue:
510
  
Inhibitor
Name:
BDBM8611
Synonyms:
4-{5H,6H,7H,8H-imidazo[1,5-a]pyridin-5-yl}benzonitrile CHEMBL9298 US9271963, Fadrozole
Type:
Small organic molecule
Emp. Form.:
C14H13N3
Mol. Mass.:
223.2731
SMILES:
N#Cc1ccc(cc1)C1CCCc2cncn12
: