Target
Cannabinoid receptor 2
Ligand
BDBM239078
Substrate
Meas. Tech.
ChEMBL_959779 (CHEMBL2383351)
Ki
0.810000±n/a nM
Citation
 Vasiljevik, TFranks, LNFord, BMDouglas, JTPrather, PLFantegrossi, WEPrisinzano, TE Design, synthesis, and biological evaluation of aminoalkylindole derivatives as cannabinoid receptor ligands with potential for treatment of alcohol abuse. J Med Chem 56:4537-50 (2013)  
Target
Name:
Cannabinoid receptor 2
Synonyms:
CANNABINOID CB2 CB2 CB2B CNR2_HUMAN Cannabinoid CB2 receptor Cannabinoid receptor 2 (CB2R) | hCB2
Type:
G Protein-Coupled Receptor (GPCR)
Mol. Mass.:
39690.94
Organism:
Homo sapiens (Human)
Description:
P34972
Residue:
360
  
Inhibitor
Name:
BDBM239078
Synonyms:
US9416103, TV-5-157
Type:
Small organic molecule
Emp. Form.:
C24H23NO2
Mol. Mass.:
357.4449
SMILES:
CCCCn1cc(C(=O)c2cccc3ccccc23)c2cccc(OC)c12
: