Target
Structural capsid protein
Ligand
BDBM50491670
Substrate
Meas. Tech.
ChEMBL_960663 (CHEMBL2390257)
IC50
160±n/a nM
Citation
 Fader, LDLandry, SMorin, SKawai, SHBousquet, YHucke, OGoudreau, NLemke, CTBonneau, PTitolo, SMason, SSimoneau, B Optimization of a 1,5-dihydrobenzo[b][1,4]diazepine-2,4-dione series of HIV capsid assembly inhibitors 1: addressing configurational instability through scaffold modification. Bioorg Med Chem Lett 23:3396-400 (2013)  
Target
Name:
Structural capsid protein
Synonyms:
Structural capsid protein | gag
Type:
PROTEIN
Mol. Mass.:
12762.23
Organism:
Human immunodeficiency virus 1
Description:
ChEMBL_106648
Residue:
115
  
Inhibitor
Name:
BDBM50491670
Synonyms:
CHEMBL2387170
Type:
Small organic molecule
Emp. Form.:
C25H20F3N3O2
Mol. Mass.:
451.4404
SMILES:
CN1c2ccc(cc2N(c2ccccc2)C(=O)C2(CCc3cc(N)ccc23)C1=O)C(F)(F)F
: