Target
Structural capsid protein
Ligand
BDBM50491672
Substrate
Meas. Tech.
ChEMBL_960663 (CHEMBL2390257)
IC50
210±n/a nM
Citation
 Fader, LDLandry, SMorin, SKawai, SHBousquet, YHucke, OGoudreau, NLemke, CTBonneau, PTitolo, SMason, SSimoneau, B Optimization of a 1,5-dihydrobenzo[b][1,4]diazepine-2,4-dione series of HIV capsid assembly inhibitors 1: addressing configurational instability through scaffold modification. Bioorg Med Chem Lett 23:3396-400 (2013)  
Target
Name:
Structural capsid protein
Synonyms:
Structural capsid protein | gag
Type:
PROTEIN
Mol. Mass.:
12762.23
Organism:
Human immunodeficiency virus 1
Description:
ChEMBL_106648
Residue:
115
  
Inhibitor
Name:
BDBM50491672
Synonyms:
CHEMBL2387157
Type:
Small organic molecule
Emp. Form.:
C24H20F3N3O3
Mol. Mass.:
455.4291
SMILES:
CCN1c2ccc(cc2N(c2ccccc2)C(=O)N(c2cccc(OC)c2)C1=O)C(F)(F)F
: