Target
Reverse transcriptase
Ligand
BDBM50492174
Substrate
Meas. Tech.
ChEMBL_968173 (CHEMBL2399276)
IC50
4.8±n/a nM
Citation
 Sturino, CFBousquet, YJames, CADeRoy, PDuplessis, MEdwards, PJHalmos, TMinville, JMorency, LMorin, SThavonekham, BTremblay, MDuan, JRibadeneira, MGarneau, MPelletier, ATremblay, SLamorte, LBethell, RCordingley, MGRajotte, DSimoneau, B Identification of potent and orally bioavailable nucleotide competing reverse transcriptase inhibitors: in vitro and in vivo optimization of a series of benzofurano[3,2-d]pyrimidin-2-one derived inhibitors. Bioorg Med Chem Lett 23:3967-75 (2013)  
Target
Name:
Reverse transcriptase
Synonyms:
Type:
Protein
Mol. Mass.:
29598.37
Organism:
Human immunodeficiency virus 1
Description:
Q9WKE8
Residue:
254
  
Inhibitor
Name:
BDBM50492174
Synonyms:
CHEMBL2397586
Type:
Small organic molecule
Emp. Form.:
C26H27N7O3
Mol. Mass.:
485.5377
SMILES:
CNc1ccc(cn1)-c1nc(=O)n(CCC2CCC(C)O2)c2c3cc(cnc3oc12)-c1cnn(C)c1
: