Target
D(2) dopamine receptor
Ligand
BDBM50020222
Substrate
Meas. Tech.
ChEMBL_63064 (CHEMBL673631)
Ki
54±n/a nM
Citation
 Stjernlöf, PElebring, TNilsson, JAndersson, BLagerkvist, SSvensson, KEkman, ACarlsson, AWikström, H 6,7,8,9-Tetrahydro-N,N-di-n-propyl-3H-benzindol-8-amines. Derivatives as potent and orally active serotonin 5-HT1A receptor agonists. J Med Chem 37:3263-73 (1994)  
Target
Name:
D(2) dopamine receptor
Synonyms:
DOPAMINE D2 DOPAMINE D2 Short Dopamine D2 receptor Drd2
Type:
G Protein-Coupled Receptor (GPCR)
Mol. Mass.:
50931.60
Organism:
Rattus norvegicus (rat)
Description:
P61169
Residue:
444
  
Inhibitor
Name:
BDBM50020222
Synonyms:
(+/-)-7-(dipropylamino)-5,6,7,8-tetrahydronaphthalen-2-ol (R,S) 7-Dipropylamino-5,6,7,8-tetrahydro-naphthalen-2-ol 7-Dipropylamino-5,6,7,8-tetrahydro-naphthalen-2-ol 7-OH-DPAT 7-OH-DPAT,(-) CHEMBL1255966 | CHEMBL285755
Type:
Small organic molecule
Emp. Form.:
C16H25NO
Mol. Mass.:
247.3758
SMILES:
CCCN(CCC)C1CCc2ccc(O)cc2C1
: