Target
Delta-type opioid receptor
Ligand
BDBM50492539
Substrate
Meas. Tech.
ChEMBL_972360 (CHEMBL2412185)
IC50
0.210000±n/a nM
Citation
 Lee, YSQu, HCDavis, PMa, SWVardanyan, RLai, JPorreca, FHruby, VJ Chiral Effect of a Phe Residue in Position 3 of the Dmt ACS Med Chem Lett 4:656-659 (2013)  
Target
Name:
Delta-type opioid receptor
Synonyms:
DOR-1 MSL-2 OPRD_MOUSE Oprd1
Type:
Enzyme Catalytic Domain
Mol. Mass.:
40577.25
Organism:
MOUSE
Description:
P32300
Residue:
372
  
Inhibitor
Name:
BDBM50492539
Synonyms:
CHEMBL2408009
Type:
Small organic molecule
Emp. Form.:
C32H35ClN4O6
Mol. Mass.:
607.097
SMILES:
Cc1cc(O)cc(C)c1C[C@H](N)C(=O)N1Cc2ccccc2C[C@@H]1C(=O)NCC(=O)N[C@@H](Cc1ccc(Cl)cc1)C(O)=O
: