Target
Melanocortin receptor 4
Ligand
BDBM50492970
Substrate
Meas. Tech.
ChEMBL_976661 (CHEMBL2417036)
Ki
3.1±n/a nM
Citation
 Alleti, RVagner, JDehigaspitiya, DCMoberg, VEElshan, NGTafreshi, NKBrabez, NWeber, CSLynch, RMHruby, VJGillies, RJMorse, DLMash, EA Synthesis and characterization of time-resolved fluorescence probes for evaluation of competitive binding to melanocortin receptors. Bioorg Med Chem 21:5029-38 (2013)  
Target
Name:
Melanocortin receptor 4
Synonyms:
MC4-R MC4R_HUMAN Melanocortin receptor 4 (MC-4) Melanocortin receptor 4 (MC4R)
Type:
Enzyme
Mol. Mass.:
36949.50
Organism:
Homo sapiens (Human)
Description:
P32245
Residue:
332
  
Inhibitor
Name:
BDBM50492970
Synonyms:
CHEMBL2415082
Type:
Small organic molecule
Emp. Form.:
C82H118N24O19
Mol. Mass.:
1743.9637
SMILES:
CCCC[C@H](NC(=O)[C@H](CO)NC(=O)[C@H](Cc1ccc(O)cc1)NC(=O)[C@H](CO)NC(=O)CCCCCN=[N+]=[N-])C(=O)N[C@@H](CCC(O)=O)C(=O)N[C@@H](Cc1cnc[nH]1)C(=O)N[C@H](Cc1ccccc1)C(=O)N[C@@H](CCCNC(N)=N)C(=O)N[C@@H](Cc1c[nH]c2ccccc12)C(=O)NCC(=O)N[C@@H](CCCCN)C(=O)N1CCC[C@H]1C(=O)N[C@@H](C(C)C)C(N)=O
: