Target
Protein kinase C eta type
Ligand
BDBM50493217
Substrate
Meas. Tech.
ChEMBL_978485 (CHEMBL2421504)
Ki
0.180000±n/a nM
Citation
 Yanagita, RCKamachi, HKikumori, MTokuda, HSuzuki, NSuenaga, KNagai, HIrie, K Effects of the methoxy group in the side chain of debromoaplysiatoxin on its tumor-promoting and anti-proliferative activities. Bioorg Med Chem Lett 23:4319-23 (2013)  
Target
Name:
Protein kinase C eta type
Synonyms:
KPCL_HUMAN PKCL PRKCL Protein kinase C, PKC; classical/novel | nPKC-eta
Type:
Enzyme
Mol. Mass.:
77844.26
Organism:
Homo sapiens (Human)
Description:
The recombinant human PKC enzymes were produced using a baculovirus expression system in SF9 cells
Residue:
683
  
Inhibitor
Name:
BDBM50493217
Synonyms:
Type:
Small organic molecule
Emp. Form.:
C31H46O9
Mol. Mass.:
562.6915
SMILES:
[H][C@]12C[C@]3(O[C@]([H])([C@@H](C)CCCc4cccc(O)c4)[C@H]1C)O[C@@](O)(CC(=O)O[C@]([H])(CC(=O)O2)[C@@H](C)O)[C@H](C)CC3(C)C
: