Target
Amine oxidase [flavin-containing] B
Ligand
BDBM11022
Substrate
Meas. Tech.
ChEMBL_1277067 (CHEMBL3088572)
Ki
2000±n/a nM
Citation
 Bonaiuto, EMilelli, ACozza, GTumiatti, VMarchetti, CAgostinelli, EFimognari, CHrelia, PMinarini, ADi Paolo, ML Novel polyamine analogues: from substrates towards potential inhibitors of monoamine oxidases. Eur J Med Chem 70:88-101 (2013)  
Target
Name:
Amine oxidase [flavin-containing] B
Synonyms:
AOFB_HUMAN MAOB Monoamine oxidase type B (MAO B) Monoamine oxidase type B (MAOB)
Type:
Protein
Mol. Mass.:
58768.76
Organism:
Homo sapiens (Human)
Description:
P27338
Residue:
520
  
Inhibitor
Name:
BDBM11022
Synonyms:
2,3-dihydro-1H-indole-2,3-dione Isatin | Isatin (Compound 1)
Type:
Small organic molecule
Emp. Form.:
C8H5NO2
Mol. Mass.:
147.1308
SMILES:
O=C1Nc2ccccc2C1=O
: