Target
Amine oxidase [flavin-containing] B
Ligand
BDBM50038188
Substrate
Meas. Tech.
ChEMBL_1278263 (CHEMBL3096735)
IC50
490±n/a nM
Citation
 Pisani, LCatto, MNicolotti, OGrossi, GDi Braccio, MSoto-Otero, RMendez-Alvarez, EStefanachi, AGadaleta, DCarotti, A Fine molecular tuning at position 4 of 2H-chromen-2-one derivatives in the search of potent and selective monoamine oxidase B inhibitors. Eur J Med Chem 70:723-39 (2013)  
Target
Name:
Amine oxidase [flavin-containing] B
Synonyms:
AOFB_RAT Amine oxidase [flavin-containing] B Monoamine Oxidase Type B (MAO-B) Monoamine oxidase B (MAO-B) Monoamine oxidase type B (MAOB) | Monoamine oxidase-B (MAO-B)
Type:
Enzyme
Mol. Mass.:
58469.65
Organism:
Rattus norvegicus (rat)
Description:
P19643
Residue:
520
  
Inhibitor
Name:
BDBM50038188
Synonyms:
CHEMBL3094029
Type:
Small organic molecule
Emp. Form.:
C16H11BrO4
Mol. Mass.:
347.16
SMILES:
Oc1cc(=O)oc2cc(OCc3cccc(Br)c3)ccc12
: