Target
Delta-type opioid receptor
Ligand
BDBM50043712
Substrate
Meas. Tech.
ChEMBL_145886 (CHEMBL754252)
IC50
0.25±n/a nM
Citation
 Misicka, ALipkowski, AWHorvath, RDavis, PYamamura, HIPorreca, FHruby, VJ Design of cyclic deltorphins and dermenkephalins with a disulfide bridge leads to analogues with high selectivity for delta-opioid receptors. J Med Chem 37:141-5 (1994)  
Target
Name:
Delta-type opioid receptor
Synonyms:
DOR-1 MSL-2 OPRD_MOUSE Oprd1
Type:
Enzyme Catalytic Domain
Mol. Mass.:
40577.25
Organism:
MOUSE
Description:
P32300
Residue:
372
  
Inhibitor
Name:
BDBM50043712
Synonyms:
CHEMBL286629 | {(4S,7R,10S,13R)-13-[(S)-2-Amino-3-(4-hydroxy-phenyl)-propionylamino]-10-benzyl-4-[(R)-1-(carbamoylmethyl-carbamoyl)-2-methyl-propylcarbamoyl]-3,3-dimethyl-6,9,12-trioxo-1,2-dithia-5,8,11-triaza-cyclotetradec-7-yl}-acetic acid
Type:
Small organic molecule
Emp. Form.:
C37H50N8O10S2
Mol. Mass.:
830.971
SMILES:
CC(C)[C@@H](NC(=O)[C@@H]1NC(=O)[C@@H](CC(O)=O)NC(=O)[C@H](Cc2ccccc2)NC(=O)[C@H](CSSC1(C)C)NC(=O)[C@@H](N)Cc1ccc(O)cc1)C(=O)NCC(N)=O
: