Target
Substance-P receptor
Ligand
BDBM50030117
Substrate
Meas. Tech.
ChEBML_141777
IC50
553±n/a nM
Citation
 MacLeod, AMMerchant, KJCascieri, MASadowski, SBer, ESwain, CJBaker, R N-acyl-L-tryptophan benzyl esters: potent substance P receptor antagonists. J Med Chem 36:2044-5 (1993)  
Target
Name:
Substance-P receptor
Synonyms:
NK-1 receptor NK1 Receptor NK1R_HUMAN Neurokinin-1 (NK-1) SPR TACR1 Tachykinin receptor 1 (NK1) | tachykinin
Type:
G Protein-Coupled Receptor (GPCR)
Mol. Mass.:
46254.43
Organism:
Homo sapiens (Human)
Description:
P25103
Residue:
407
  
Inhibitor
Name:
BDBM50030117
Synonyms:
(S)-2-Dimethylamino-3-(1H-indol-3-yl)-propionic acid 3,5-dimethyl-benzyl ester CHEMBL23715
Type:
Small organic molecule
Emp. Form.:
C22H26N2O2
Mol. Mass.:
350.454
SMILES:
CN(C)[C@@H](Cc1c[nH]c2ccccc12)C(=O)OCc1cc(C)cc(C)c1
: