Target
Substance-P receptor
Ligand
BDBM50030124
Substrate
Meas. Tech.
ChEBML_141777
IC50
>10000±n/a nM
Citation
 MacLeod, AMMerchant, KJCascieri, MASadowski, SBer, ESwain, CJBaker, R N-acyl-L-tryptophan benzyl esters: potent substance P receptor antagonists. J Med Chem 36:2044-5 (1993)  
Target
Name:
Substance-P receptor
Synonyms:
NK-1 receptor NK1 Receptor NK1R_HUMAN Neurokinin-1 (NK-1) SPR TACR1 Tachykinin receptor 1 (NK1) | tachykinin
Type:
G Protein-Coupled Receptor (GPCR)
Mol. Mass.:
46254.43
Organism:
Homo sapiens (Human)
Description:
P25103
Residue:
407
  
Inhibitor
Name:
BDBM50030124
Synonyms:
(S)-2-Amino-3-(1H-indol-3-yl)-propionic acid benzyl ester CHEMBL278555
Type:
Small organic molecule
Emp. Form.:
C18H18N2O2
Mol. Mass.:
294.3477
SMILES:
N[C@@H](Cc1c[nH]c2ccccc12)C(=O)OCc1ccccc1
: