Target
Gastrin/cholecystokinin type B receptor
Ligand
BDBM50045815
Substrate
Meas. Tech.
ChEBML_49880
Ki
134±n/a nM
Citation
 Blommaert, AGWeng, JHDorville, AMcCort, IDucos, BDurieux, CRoques, BP Cholecystokinin peptidomimetics as selective CCK-B antagonists: design, synthesis, and in vitro and in vivo biochemical properties. J Med Chem 36:2868-77 (1993)  
Target
Name:
Gastrin/cholecystokinin type B receptor
Synonyms:
CCK-2 receptor CCK-BR CCKRB Cholecystokinin receptor GASR_HUMAN | Gastrin/cholecystokinin type B receptor
Type:
G Protein-Coupled Receptor (GPCR)
Mol. Mass.:
48445.79
Organism:
Homo sapiens (Human)
Description:
Stable expression of human CCK-2 receptors in HEK 293 cells.
Residue:
447
  
Inhibitor
Name:
BDBM50045815
Synonyms:
CHEMBL98516 | {[2-(Adamantan-2-yloxycarbonylamino)-2-methyl-3-naphthalen-1-yl-propionyl]-phenethyl-amino}-acetic acid
Type:
Small organic molecule
Emp. Form.:
C35H40N2O5
Mol. Mass.:
568.7025
SMILES:
CC(Cc1cccc2ccccc12)(NC(=O)OC1[C@H]2C[C@@H]3C[C@@H](C[C@H]1C3)C2)C(=O)N(CCc1ccccc1)CC(O)=O
: