Target
Gastrin/cholecystokinin type B receptor
Ligand
BDBM50045805
Substrate
Meas. Tech.
ChEBML_48413
Ki
14±n/a nM
Citation
 Blommaert, AGWeng, JHDorville, AMcCort, IDucos, BDurieux, CRoques, BP Cholecystokinin peptidomimetics as selective CCK-B antagonists: design, synthesis, and in vitro and in vivo biochemical properties. J Med Chem 36:2868-77 (1993)  
Target
Name:
Gastrin/cholecystokinin type B receptor
Synonyms:
Cckbr Cholecystokinin receptor Gastrin/cholecystokinin type B receptor
Type:
Enzyme Catalytic Domain
Mol. Mass.:
49196.59
Organism:
MOUSE
Description:
Cholecystokinin A CCKBR MOUSE::P56481
Residue:
453
  
Inhibitor
Name:
BDBM50045805
Synonyms:
CHEMBL318852 | N-Carboxymethyl-N-[2-(2,4-dichloro-phenyl)-ethyl]-2-(1H-indol-3-ylmethyl)-2-methyl-malonamic acid adamantan-2-yl ester
Type:
Small organic molecule
Emp. Form.:
C33H36Cl2N2O5
Mol. Mass.:
611.555
SMILES:
CC(Cc1c[nH]c2ccccc12)(C(=O)OC1[C@H]2C[C@@H]3C[C@@H](C[C@H]1C3)C2)C(=O)N(CCc1ccc(Cl)cc1Cl)CC(O)=O
: