Target
Gastrin/cholecystokinin type B receptor
Ligand
BDBM50045805
Substrate
Meas. Tech.
ChEBML_49880
Ki
12±n/a nM
Citation
 Blommaert, AGWeng, JHDorville, AMcCort, IDucos, BDurieux, CRoques, BP Cholecystokinin peptidomimetics as selective CCK-B antagonists: design, synthesis, and in vitro and in vivo biochemical properties. J Med Chem 36:2868-77 (1993)  
Target
Name:
Gastrin/cholecystokinin type B receptor
Synonyms:
CCK-2 receptor CCK-BR CCKRB Cholecystokinin receptor GASR_HUMAN | Gastrin/cholecystokinin type B receptor
Type:
G Protein-Coupled Receptor (GPCR)
Mol. Mass.:
48445.79
Organism:
Homo sapiens (Human)
Description:
Stable expression of human CCK-2 receptors in HEK 293 cells.
Residue:
447
  
Inhibitor
Name:
BDBM50045805
Synonyms:
CHEMBL318852 | N-Carboxymethyl-N-[2-(2,4-dichloro-phenyl)-ethyl]-2-(1H-indol-3-ylmethyl)-2-methyl-malonamic acid adamantan-2-yl ester
Type:
Small organic molecule
Emp. Form.:
C33H36Cl2N2O5
Mol. Mass.:
611.555
SMILES:
CC(Cc1c[nH]c2ccccc12)(C(=O)OC1[C@H]2C[C@@H]3C[C@@H](C[C@H]1C3)C2)C(=O)N(CCc1ccc(Cl)cc1Cl)CC(O)=O
: