Target
Gastrin/cholecystokinin type B receptor
Ligand
BDBM50045796
Substrate
Meas. Tech.
ChEMBL_48610 (CHEMBL659591)
Ki
18±n/a nM
Citation
 Blommaert, AGWeng, JHDorville, AMcCort, IDucos, BDurieux, CRoques, BP Cholecystokinin peptidomimetics as selective CCK-B antagonists: design, synthesis, and in vitro and in vivo biochemical properties. J Med Chem 36:2868-77 (1993)  
Target
Name:
Gastrin/cholecystokinin type B receptor
Synonyms:
Cckbr Cholecystokinin B receptor GASR_RAT | Gastrin/cholecystokinin type B receptor
Type:
Enzyme Catalytic Domain
Mol. Mass.:
48980.43
Organism:
RAT
Description:
Cholecystokinin A CCKBR RAT::P30553
Residue:
452
  
Inhibitor
Name:
BDBM50045796
Synonyms:
CHEMBL99939 | {[2-(Adamantan-2-yloxycarbonylamino)-3-(1H-indol-3-yl)-2-methyl-propionyl]-[2-(4-chloro-phenyl)-ethyl]-amino}-acetic acid
Type:
Small organic molecule
Emp. Form.:
C33H38ClN3O5
Mol. Mass.:
592.125
SMILES:
CC(Cc1c[nH]c2ccccc12)(NC(=O)OC1[C@H]2C[C@@H]3C[C@@H](C[C@H]1C3)C2)C(=O)N(CCc1ccc(Cl)cc1)CC(O)=O
: