Target
High affinity cAMP-specific 3',5'-cyclic phosphodiesterase 7A/cAMP-specific 3',5'-cyclic phosphodiesterase 7B
Ligand
BDBM50497974
Substrate
Meas. Tech.
ChEMBL_1446992 (CHEMBL3373749)
IC50
>30000±n/a nM
Citation
 Hu, EChen, NBourbeau, MPHarrington, PEBiswas, KKunz, RKAndrews, KLChmait, SZhao, XDavis, CMa, JShi, JLester-Zeiner, DDanao, JAble, JCueva, MTalreja, SKornecook, TChen, HPorter, AHungate, RTreanor, JAllen, JR Discovery of clinical candidate 1-(4-(3-(4-(1H-benzo[d]imidazole-2-carbonyl)phenoxy)pyrazin-2-yl)piperidin-1-yl)ethanone (AMG 579), a potent, selective, and efficacious inhibitor of phosphodiesterase 10A (PDE10A). J Med Chem 57:6632-41 (2014)  
Target
Name:
High affinity cAMP-specific 3',5'-cyclic phosphodiesterase 7A/cAMP-specific 3',5'-cyclic phosphodiesterase 7B
Synonyms:
Phosphodiesterase 7
Type:
Mol. Mass.:
Description:
ASSAY_ID of ChEMBL is 302392
Components:
This complex has 2 components.
Component 1
Name:
cAMP-specific 3',5'-cyclic phosphodiesterase 7B
Synonyms:
3',5'-cyclic phosphodiesterase PDE7B_HUMAN Phosphodiesterase 7B (PDE7B) | cAMP-specific 3',5'-cyclic phosphodiesterase 7B
Type:
Enzyme
Mol. Mass.:
51842.76
Organism:
Homo sapiens (Human)
Description:
Q9NP56
Residue:
450
  
Component 2
Name:
High affinity cAMP-specific 3',5'-cyclic phosphodiesterase 7A
Synonyms:
3',5'-cyclic phosphodiesterase PDE7A_HUMAN Phosphodiesterase 7 (PDE7) Phosphodiesterase 7A (PDE7A1)
Type:
Enzyme
Mol. Mass.:
55514.96
Organism:
Homo sapiens (Human)
Description:
Q13946
Residue:
482
  
Inhibitor
Name:
BDBM50497974
Synonyms:
CHEMBL3319209
Type:
Small organic molecule
Emp. Form.:
C25H23N5O3
Mol. Mass.:
441.4818
SMILES:
CC(=O)N1CCC(CC1)c1nccnc1Oc1ccc(cc1)C(=O)c1nc2ccccc2[nH]1
: