Target
cGMP-dependent 3',5'-cyclic phosphodiesterase
Ligand
BDBM50497974
Substrate
Meas. Tech.
ChEMBL_1446987 (CHEMBL3373744)
IC50
>30000±n/a nM
Citation
 Hu, EChen, NBourbeau, MPHarrington, PEBiswas, KKunz, RKAndrews, KLChmait, SZhao, XDavis, CMa, JShi, JLester-Zeiner, DDanao, JAble, JCueva, MTalreja, SKornecook, TChen, HPorter, AHungate, RTreanor, JAllen, JR Discovery of clinical candidate 1-(4-(3-(4-(1H-benzo[d]imidazole-2-carbonyl)phenoxy)pyrazin-2-yl)piperidin-1-yl)ethanone (AMG 579), a potent, selective, and efficacious inhibitor of phosphodiesterase 10A (PDE10A). J Med Chem 57:6632-41 (2014)  
Target
Name:
cGMP-dependent 3',5'-cyclic phosphodiesterase
Synonyms:
CGS-PDE Homo sapiens phosphodiesterase 2A (PDE2A) PDE2A cGSPDE
Type:
Enzyme Catalytic Domain
Mol. Mass.:
105691.58
Organism:
Homo sapiens (Human)
Description:
O00408
Residue:
941
  
Inhibitor
Name:
BDBM50497974
Synonyms:
CHEMBL3319209
Type:
Small organic molecule
Emp. Form.:
C25H23N5O3
Mol. Mass.:
441.4818
SMILES:
CC(=O)N1CCC(CC1)c1nccnc1Oc1ccc(cc1)C(=O)c1nc2ccccc2[nH]1
: