Target
cAMP and cAMP-inhibited cGMP 3',5'-cyclic phosphodiesterase 10A
Ligand
BDBM50494199
Substrate
Meas. Tech.
ChEMBL_1460217 (CHEMBL3369681)
IC50
4.5±n/a nM
Citation
 Hu, EChen, NBourbeau, MPHarrington, PEBiswas, KKunz, RKAndrews, KLChmait, SZhao, XDavis, CMa, JShi, JLester-Zeiner, DDanao, JAble, JCueva, MTalreja, SKornecook, TChen, HPorter, AHungate, RTreanor, JAllen, JR Discovery of clinical candidate 1-(4-(3-(4-(1H-benzo[d]imidazole-2-carbonyl)phenoxy)pyrazin-2-yl)piperidin-1-yl)ethanone (AMG 579), a potent, selective, and efficacious inhibitor of phosphodiesterase 10A (PDE10A). J Med Chem 57:6632-41 (2014)  
Target
Name:
cAMP and cAMP-inhibited cGMP 3',5'-cyclic phosphodiesterase 10A
Synonyms:
3',5'-cyclic phosphodiesterase PDE10A Phosphodiesterase 10 (PDE10) | Phosphodiesterase 10A
Type:
Protein
Mol. Mass.:
88412.52
Organism:
Homo sapiens (Human)
Description:
Q9Y233
Residue:
1055
  
Inhibitor
Name:
BDBM50494199
Synonyms:
CHEMBL3086091
Type:
Small organic molecule
Emp. Form.:
C22H19N5O3
Mol. Mass.:
401.418
SMILES:
O=C(c1nc2ccccc2[nH]1)c1ccc(Oc2nccnc2N2CCOCC2)cc1
: