Target
Reverse transcriptase
Ligand
BDBM50498753
Substrate
Meas. Tech.
ChEMBL_1522234 (CHEMBL3626463)
IC50
1840±n/a nM
Citation
 Wan, ZYYao, JMao, TQWang, XLWang, HFChen, WXYin, HChen, FEDe Clercq, EDaelemans, DPannecouque, C Pyrimidine sulfonylacetanilides with improved potency against key mutant viruses of HIV-1 by specific targeting of a highly conserved residue. Eur J Med Chem 102:215-22 (2015)  
Target
Name:
Reverse transcriptase
Synonyms:
Type:
Protein
Mol. Mass.:
29598.37
Organism:
Human immunodeficiency virus 1
Description:
Q9WKE8
Residue:
254
  
Inhibitor
Name:
BDBM50498753
Synonyms:
CHEMBL3621384
Type:
Small organic molecule
Emp. Form.:
C21H17FN4O4S
Mol. Mass.:
440.447
SMILES:
Cc1cc(cc(C)c1Oc1ccnc(n1)S(=O)(=O)CC(=O)Nc1ccc(F)cc1)C#N
: