Target
Serine/threonine-protein kinase pim-3
Ligand
BDBM50499280
Substrate
Meas. Tech.
ChEMBL_1537949 (CHEMBL3738382)
IC50
6.4±n/a nM
Citation
 Nakano, HHasegawa, TSaito, NFurukawa, KMukaida, NKojima, HOkabe, TNagano, T Design and synthesis of an in vivo-efficacious PIM3 kinase inhibitor as a candidate anti-pancreatic cancer agent. Bioorg Med Chem Lett 25:5687-93 (2015)  
Target
Name:
Serine/threonine-protein kinase pim-3
Synonyms:
PIM3 Serine/threonine-protein kinase pim-3 (PIM3)
Type:
Protein
Mol. Mass.:
35888.19
Organism:
Homo sapiens (Human)
Description:
Q86V86
Residue:
326
  
Inhibitor
Name:
BDBM50499280
Synonyms:
CHEMBL3735412
Type:
Small organic molecule
Emp. Form.:
C23H25N5O4
Mol. Mass.:
435.4757
SMILES:
CC(N1CCNCC1)c1c2O\C(=C/c3n[nH]c4ncccc34)C(=O)c2ccc1OCCO
: