Target
Glycogen synthase kinase-3 beta
Ligand
BDBM50499279
Substrate
Meas. Tech.
ChEMBL_1538133 (CHEMBL3736656)
IC50
6.1±n/a nM
Citation
 Nakano, HHasegawa, TSaito, NFurukawa, KMukaida, NKojima, HOkabe, TNagano, T Design and synthesis of an in vivo-efficacious PIM3 kinase inhibitor as a candidate anti-pancreatic cancer agent. Bioorg Med Chem Lett 25:5687-93 (2015)  
Target
Name:
Glycogen synthase kinase-3 beta
Synonyms:
GSK-3 beta GSK3B Glycogen synthase kinase 3 beta (GSK3B) Glycogen synthase kinase-3 beta (GSK-3B) Glycogen synthase kinase-3 beta (GSK3B) Glycogen synthase kinase-3beta (GSK3B) | Serine/threonine-protein kinase GSK3B
Type:
Enzyme
Mol. Mass.:
46756.38
Organism:
Homo sapiens (Human)
Description:
P49841
Residue:
420
  
Inhibitor
Name:
BDBM50499279
Synonyms:
CHEMBL3735890
Type:
Small organic molecule
Emp. Form.:
C22H23N5O3
Mol. Mass.:
405.4497
SMILES:
COc1ccc2C(=O)\C(Oc2c1C(C)N1CCNCC1)=C\c1n[nH]c2ncccc12
: