Target
Serine/threonine-protein kinase pim-3
Ligand
BDBM50499282
Substrate
Meas. Tech.
ChEMBL_1537949 (CHEMBL3738382)
IC50
3.0±n/a nM
Citation
 Nakano, HHasegawa, TSaito, NFurukawa, KMukaida, NKojima, HOkabe, TNagano, T Design and synthesis of an in vivo-efficacious PIM3 kinase inhibitor as a candidate anti-pancreatic cancer agent. Bioorg Med Chem Lett 25:5687-93 (2015)  
Target
Name:
Serine/threonine-protein kinase pim-3
Synonyms:
PIM3 Serine/threonine-protein kinase pim-3 (PIM3)
Type:
Protein
Mol. Mass.:
35888.19
Organism:
Homo sapiens (Human)
Description:
Q86V86
Residue:
326
  
Inhibitor
Name:
BDBM50499282
Synonyms:
CHEMBL3735657
Type:
Small organic molecule
Emp. Form.:
C24H27N5O4
Mol. Mass.:
449.5023
SMILES:
COCCOc1ccc2C(=O)\C(Oc2c1C(C)N1CCNCC1)=C\c1n[nH]c2ncccc12
: