Target
Signal transducer and activator of transcription 6
Ligand
BDBM50499611
Substrate
Meas. Tech.
ChEMBL_1542401 (CHEMBL3743438)
IC50
540±n/a nM
Citation
 Mandal, PKMorlacchi, PKnight, JMLink, TMLee, GRNurieva, RSingh, DDhanik, AKavraki, LCorry, DBLadbury, JEMcMurray, JS Targeting the Src Homology 2 (SH2) Domain of Signal Transducer and Activator of Transcription 6 (STAT6) with Cell-Permeable, Phosphatase-Stable Phosphopeptide Mimics Potently Inhibits Tyr641 Phosphorylation and Transcriptional Activity. J Med Chem 58:8970-84 (2015)  
Target
Name:
Signal transducer and activator of transcription 6
Synonyms:
STAT6 | STAT6_HUMAN
Type:
PROTEIN
Mol. Mass.:
94129.45
Organism:
Homo sapiens (Human)
Description:
ChEMBL_881634
Residue:
847
  
Inhibitor
Name:
BDBM50499611
Synonyms:
CHEMBL3740610
Type:
Small organic molecule
Emp. Form.:
C30H39N2O6P
Mol. Mass.:
554.6142
SMILES:
C\C(=C/C(=O)N[C@H](C(=O)N1CCCC1\C=C\CCc1ccccc1)C(C)(C)C)c1ccc(OP(O)(O)=O)cc1
: