Target
Signal transducer and activator of transcription 6
Ligand
BDBM50499624
Substrate
Meas. Tech.
ChEMBL_1542401 (CHEMBL3743438)
IC50
120±n/a nM
Citation
 Mandal, PKMorlacchi, PKnight, JMLink, TMLee, GRNurieva, RSingh, DDhanik, AKavraki, LCorry, DBLadbury, JEMcMurray, JS Targeting the Src Homology 2 (SH2) Domain of Signal Transducer and Activator of Transcription 6 (STAT6) with Cell-Permeable, Phosphatase-Stable Phosphopeptide Mimics Potently Inhibits Tyr641 Phosphorylation and Transcriptional Activity. J Med Chem 58:8970-84 (2015)  
Target
Name:
Signal transducer and activator of transcription 6
Synonyms:
STAT6 | STAT6_HUMAN
Type:
PROTEIN
Mol. Mass.:
94129.45
Organism:
Homo sapiens (Human)
Description:
ChEMBL_881634
Residue:
847
  
Inhibitor
Name:
BDBM50499624
Synonyms:
CHEMBL3740709
Type:
Small organic molecule
Emp. Form.:
C32H36N3O7P
Mol. Mass.:
605.6179
SMILES:
CC(C)(C)[C@H](NC(=O)\C=C\c1ccc(OP(O)(O)=O)cc1)C(=O)N1CCC[C@H]1C(=O)N(c1ccccc1)c1ccccc1
: