Target
Substance-P receptor
Ligand
BDBM50049311
Substrate
Meas. Tech.
ChEMBL_205731 (CHEMBL809498)
IC50
7.2±n/a nM
Citation
 Hipskind, PAHowbert, JJBruns, RFCho, SSCrowell, TAForeman, MMGehlert, DRIyengar, SJohnson, KWKrushinski, JHLi, DLLobb, KLMason, NRMuehl, BSNixon, JAPhebus, LARegoli, DSimmons, RMThrelkeld, PGWaters, DCGitter, BD 3-Aryl-1,2-diacetamidopropane derivatives as novel and potent NK-1 receptor antagonists. J Med Chem 39:736-48 (1996)  
Target
Name:
Substance-P receptor
Synonyms:
NK-1 receptor NK1 Receptor NK1R_HUMAN Neurokinin-1 (NK-1) SPR TACR1 Tachykinin receptor 1 (NK1) | tachykinin
Type:
G Protein-Coupled Receptor (GPCR)
Mol. Mass.:
46254.43
Organism:
Homo sapiens (Human)
Description:
P25103
Residue:
407
  
Inhibitor
Name:
BDBM50049311
Synonyms:
CHEMBL166178 | N-[1-{[Acetyl-(2-methylsulfanyl-benzyl)-amino]-methyl}-2-(1H-indol-3-yl)-ethyl]-2-(4-phenyl-piperazin-1-yl)-acetamide
Type:
Small organic molecule
Emp. Form.:
C33H39N5O2S
Mol. Mass.:
569.76
SMILES:
CSc1ccccc1CN(CC(Cc1c[nH]c2ccccc12)NC(=O)CN1CCN(CC1)c1ccccc1)C(C)=O
: