Target
Substance-P receptor
Ligand
BDBM50029885
Substrate
Meas. Tech.
ChEMBL_205731 (CHEMBL809498)
IC50
30±n/a nM
Citation
 Hipskind, PAHowbert, JJBruns, RFCho, SSCrowell, TAForeman, MMGehlert, DRIyengar, SJohnson, KWKrushinski, JHLi, DLLobb, KLMason, NRMuehl, BSNixon, JAPhebus, LARegoli, DSimmons, RMThrelkeld, PGWaters, DCGitter, BD 3-Aryl-1,2-diacetamidopropane derivatives as novel and potent NK-1 receptor antagonists. J Med Chem 39:736-48 (1996)  
Target
Name:
Substance-P receptor
Synonyms:
NK-1 receptor NK1 Receptor NK1R_HUMAN Neurokinin-1 (NK-1) SPR TACR1 Tachykinin receptor 1 (NK1) | tachykinin
Type:
G Protein-Coupled Receptor (GPCR)
Mol. Mass.:
46254.43
Organism:
Homo sapiens (Human)
Description:
P25103
Residue:
407
  
Inhibitor
Name:
BDBM50029885
Synonyms:
(3aR,7aR)-2-[1-Imino-2-(2-methoxy-phenyl)-ethyl]-7,7-diphenyl-octahydro-isoindol-4-one CHEMBL131171 RP-67580
Type:
Small organic molecule
Emp. Form.:
C29H30N2O2
Mol. Mass.:
438.5607
SMILES:
COc1ccccc1CC(=N)N1C[C@H]2[C@@H](C1)C(CCC2=O)(c1ccccc1)c1ccccc1
: