Target
Substance-P receptor
Ligand
BDBM50049343
Substrate
Meas. Tech.
ChEMBL_205731 (CHEMBL809498)
IC50
2.73±n/a nM
Citation
 Hipskind, PAHowbert, JJBruns, RFCho, SSCrowell, TAForeman, MMGehlert, DRIyengar, SJohnson, KWKrushinski, JHLi, DLLobb, KLMason, NRMuehl, BSNixon, JAPhebus, LARegoli, DSimmons, RMThrelkeld, PGWaters, DCGitter, BD 3-Aryl-1,2-diacetamidopropane derivatives as novel and potent NK-1 receptor antagonists. J Med Chem 39:736-48 (1996)  
Target
Name:
Substance-P receptor
Synonyms:
NK-1 receptor NK1 Receptor NK1R_HUMAN Neurokinin-1 (NK-1) SPR TACR1 Tachykinin receptor 1 (NK1) | tachykinin
Type:
G Protein-Coupled Receptor (GPCR)
Mol. Mass.:
46254.43
Organism:
Homo sapiens (Human)
Description:
P25103
Residue:
407
  
Inhibitor
Name:
BDBM50049343
Synonyms:
CHEMBL106334 | N-{2-[Acetyl-(2-methoxy-benzyl)-amino]-1-naphthalen-1-ylmethyl-ethyl}-2-(4-phenyl-piperazin-1-yl)-acetamide
Type:
Small organic molecule
Emp. Form.:
C35H40N4O3
Mol. Mass.:
564.7171
SMILES:
COc1ccccc1CN(CC(Cc1cccc2ccccc12)NC(=O)CN1CCN(CC1)c1ccccc1)C(C)=O
: