Target
Substance-P receptor
Ligand
BDBM50000040
Substrate
Meas. Tech.
ChEMBL_208661 (CHEMBL813321)
IC50
32±n/a nM
Citation
 Hipskind, PAHowbert, JJBruns, RFCho, SSCrowell, TAForeman, MMGehlert, DRIyengar, SJohnson, KWKrushinski, JHLi, DLLobb, KLMason, NRMuehl, BSNixon, JAPhebus, LARegoli, DSimmons, RMThrelkeld, PGWaters, DCGitter, BD 3-Aryl-1,2-diacetamidopropane derivatives as novel and potent NK-1 receptor antagonists. J Med Chem 39:736-48 (1996)  
Target
Name:
Substance-P receptor
Synonyms:
NK-1 receptor NK1 Receptor Neurokinin 1 receptor SPR Tac1r Tacr1
Type:
G Protein-Coupled Receptor (GPCR)
Mol. Mass.:
46371.54
Organism:
Rattus norvegicus (rat)
Description:
Competition binding assays were carried out using membrane preparations from transfected CHO cells that constitutively expressed the rat NK1 receptor.
Residue:
407
  
Inhibitor
Name:
BDBM50000040
Synonyms:
((2S,3S)-2-Benzhydryl-1-aza-bicyclo[2.2.2]oct-3-yl)-(2-methoxy-benzyl)-amine (+)(2-Benzhydryl-1-aza-bicyclo[2.2.2]oct-3-yl)-(2-methoxy-benzyl)-amine (2-Benzhydryl-1-aza-bicyclo[2.2.2]oct-3-yl)-(2-methoxy-benzyl)-amine CP-96,345 i(2-Benzhydryl-1-aza-bicyclo[2.2.2]oct-3-yl)-(2-methoxy-benzyl)-amine
Type:
Small organic molecule
Emp. Form.:
C28H32N2O
Mol. Mass.:
412.5665
SMILES:
COc1ccccc1CN[C@H]1C2CCN(CC2)[C@H]1C(c1ccccc1)c1ccccc1
: