Target
Neuropeptide Y receptor type 1
Ligand
BDBM50246649
Substrate
Meas. Tech.
ChEMBL_1543514 (CHEMBL3750361)
Ki
0.420000±n/a nM
Citation
 Keller, MWeiss, SHutzler, CKuhn, KKMollereau, CDukorn, SSchindler, LBernhardt, GKönig, BBuschauer, A N(?)-Carbamoylation of the Argininamide Moiety: An Avenue to Insurmountable NPY Y1 Receptor Antagonists and a Radiolabeled Selective High-Affinity Molecular Tool ([(3)H]UR-MK299) with Extended Residence Time. J Med Chem 58:8834-49 (2015)  
Target
Name:
Neuropeptide Y receptor type 1
Synonyms:
NPY-Y1 NPY1R NPYR neuropeptide Y receptor Y1
Type:
Enzyme Catalytic Domain
Mol. Mass.:
44399.07
Organism:
Homo sapiens (Human)
Description:
NPY-Y1 NPY1R HUMAN::P25929
Residue:
384
  
Inhibitor
Name:
BDBM50246649
Synonyms:
(R)-ethyl 2-(3-((5-(4-hydroxybenzylamino)-4-(2,2-diphenylacetamido)-5-oxopentylamino)(amino)methylene)ureido)acetate | CHEMBL508974
Type:
Small organic molecule
Emp. Form.:
C32H38N6O6
Mol. Mass.:
602.6807
SMILES:
CCOC(=O)CNC(=O)NC(N)=NCCC[C@@H](NC(=O)C(c1ccccc1)c1ccccc1)C(=O)NCc1ccc(O)cc1
: