Target
Neuropeptide Y receptor type 1
Ligand
BDBM50060728
Substrate
Meas. Tech.
ChEMBL_1543497 (CHEMBL3750344)
Kd
2.1±n/a nM
Citation
 Keller, MWeiss, SHutzler, CKuhn, KKMollereau, CDukorn, SSchindler, LBernhardt, GKönig, BBuschauer, A N(?)-Carbamoylation of the Argininamide Moiety: An Avenue to Insurmountable NPY Y1 Receptor Antagonists and a Radiolabeled Selective High-Affinity Molecular Tool ([(3)H]UR-MK299) with Extended Residence Time. J Med Chem 58:8834-49 (2015)  
Target
Name:
Neuropeptide Y receptor type 1
Synonyms:
NPY-Y1 NPY1R NPYR neuropeptide Y receptor Y1
Type:
Enzyme Catalytic Domain
Mol. Mass.:
44399.07
Organism:
Homo sapiens (Human)
Description:
NPY-Y1 NPY1R HUMAN::P25929
Residue:
384
  
Inhibitor
Name:
BDBM50060728
Synonyms:
(R)-2-(2,2-diphenylacetamido)-5-guanidino-N-(4-hydroxybenzyl)pentanamide (R)-5-(diaminomethyleneamino)-2-(2,2-diphenylacetamido)-N-(4-hydroxybenzyl)pentanamide | CHEMBL332347
Type:
Small organic molecule
Emp. Form.:
C27H31N5O3
Mol. Mass.:
473.5667
SMILES:
[#7]\[#6](-[#7])=[#7]\[#6]-[#6]-[#6]-[#6@@H](-[#7]-[#6](=O)-[#6](-c1ccccc1)-c1ccccc1)-[#6](=O)-[#7]-[#6]-c1ccc(-[#8])cc1
: