Target
Melanocortin receptor 3
Ligand
BDBM50500592
Substrate
Meas. Tech.
ChEMBL_1548273 (CHEMBL3755540)
EC50
1.9±n/a nM
Citation
 Carotenuto, AMerlino, FCai, MBrancaccio, DYousif, AMNovellino, EHruby, VJGrieco, P Discovery of Novel Potent and Selective Agonists at the Melanocortin-3 Receptor. J Med Chem 58:9773-8 (2015)  
Target
Name:
Melanocortin receptor 3
Synonyms:
MC3-R MC3R_HUMAN Melanocortin receptor (M3 and M4)
Type:
Enzyme
Mol. Mass.:
36044.86
Organism:
Homo sapiens (Human)
Description:
P41968
Residue:
323
  
Inhibitor
Name:
BDBM50500592
Synonyms:
CHEMBL3752534
Type:
Small organic molecule
Emp. Form.:
C58H78N14O10
Mol. Mass.:
1131.3277
SMILES:
[H][C@@]12CCCN1C(=O)[C@]1([H])CCCN1C(=O)[C@H](CC(=O)NCCCC[C@H](NC(=O)[C@H](Cc1c[nH]c3ccccc13)NC(=O)[C@H](CCCNC(N)=N)NC(=O)[C@@H](Cc1ccc3ccccc3c1)NC2=O)C(N)=O)NC(=O)[C@H](CCCC)NC(C)=O
: