Target
Melanocyte-stimulating hormone receptor
Ligand
BDBM50027084
Substrate
Meas. Tech.
ChEMBL_1548272 (CHEMBL3755539)
EC50
1.8±n/a nM
Citation
 Carotenuto, AMerlino, FCai, MBrancaccio, DYousif, AMNovellino, EHruby, VJGrieco, P Discovery of Novel Potent and Selective Agonists at the Melanocortin-3 Receptor. J Med Chem 58:9773-8 (2015)  
Target
Name:
Melanocyte-stimulating hormone receptor
Synonyms:
MC1-R MSH-R MSHR_HUMAN Melanocortin receptor (M1 and M4) Melanocortin receptor 1 (MC1-R) | Melanocortin receptor 1 (MC1R)
Type:
Enzyme
Mol. Mass.:
34717.23
Organism:
Homo sapiens (Human)
Description:
Q01726
Residue:
317
  
Inhibitor
Name:
BDBM50027084
Synonyms:
Melatonan
Type:
Small organic molecule
Emp. Form.:
C50H69N15O9
Mol. Mass.:
1024.178
SMILES:
CCCC[C@H](NC(C)=O)C(=O)N[C@H]1CC(=O)NCCCC[C@H](NC(=O)[C@H](Cc2c[nH]c3ccccc23)NC(=O)[C@H](CCCNC(N)=N)NC(=O)[C@@H](Cc2ccccc2)NC(=O)[C@H](Cc2cnc[nH]2)NC1=O)C(N)=O
: