Target
Melanocortin receptor 5
Ligand
BDBM50500592
Substrate
Meas. Tech.
ChEMBL_1548271 (CHEMBL3755538)
IC50
300±n/a nM
Citation
 Carotenuto, AMerlino, FCai, MBrancaccio, DYousif, AMNovellino, EHruby, VJGrieco, P Discovery of Novel Potent and Selective Agonists at the Melanocortin-3 Receptor. J Med Chem 58:9773-8 (2015)  
Target
Name:
Melanocortin receptor 5
Synonyms:
MC-2 MC5R Melanocortin MC5 Melanocortin receptor 5 | Melanocortin receptor 5 (MC5R)
Type:
Enzyme
Mol. Mass.:
36612.92
Organism:
Homo sapiens (Human)
Description:
P33032
Residue:
325
  
Inhibitor
Name:
BDBM50500592
Synonyms:
CHEMBL3752534
Type:
Small organic molecule
Emp. Form.:
C58H78N14O10
Mol. Mass.:
1131.3277
SMILES:
[H][C@@]12CCCN1C(=O)[C@]1([H])CCCN1C(=O)[C@H](CC(=O)NCCCC[C@H](NC(=O)[C@H](Cc1c[nH]c3ccccc13)NC(=O)[C@H](CCCNC(N)=N)NC(=O)[C@@H](Cc1ccc3ccccc3c1)NC2=O)C(N)=O)NC(=O)[C@H](CCCC)NC(C)=O
: